Page MenuHomePhabricator

Error building E.

Authored by abyomi0 on Apr 24 2014, 4:28 PM.
/usr/bin/ld: src/bin/src_bin_enlightenment-e_uuid_store.o: undefined reference to symbol 'shm_unlink@@GLIBC_2.2.5'
/usr/lib/ error adding symbols: DSO missing from command line
collect2: error: ld returned 1 exit status
Makefile:8532: recipe for target 'src/bin/enlightenment' failed
make[2]: *** [src/bin/enlightenment] Error 1
make[2]: *** Waiting for unfinished jobs....
make[2]: Leaving directory '/tmp/enlightenment-git/src/enlightenment'
Makefile:15036: recipe for target 'all-recursive' failed
make[1]: *** [all-recursive] Error 1
make[1]: Leaving directory '/tmp/enlightenment-git/src/enlightenment'
Makefile:4591: recipe for target 'all' failed
make: *** [all] Error 2
==> ERROR: A failure occurred in build().
==> ERROR: Makepkg was unable to build enlightenment-git.
==> Restart building enlightenment-git ? [y/N]
abyomi0 edited the content of this paste. (Show Details)Apr 24 2014, 4:28 PM
abyomi0 changed the title of this paste from untitled to Error building E. .
abyomi0 updated the paste's language from autodetect to autodetect.
abyomi0 changed the visibility from "All Users" to "Public (No Login Required)".