Page MenuHomePhabricator

Compilation broken with ...
Closed, ResolvedPublic

Description

git

  CC       bin/elua/bin_elua_elua-main.o
  CC       bin/efreet/bin_efreet_efreet_desktop_cache_create-efreet_desktop_cache_create.o
  CC       bin/efreet/bin_efreet_efreet_icon_cache_create-efreet_icon_cache_create.o
bin/eolian_cxx/eolian_cxx.cc: In function ‘bool eolian_cxx::types_generate(const string
                                                                      ^
  CC       bin/efreet/bin_efreet_efreet_mime_cache_create-efreet_mime_cache_create.o
  CC       bin/ethumb_client/bin_ethumb_client_ethumbd_slave-ethumbd_slave.o
  CC       bin/evas/bin_evas_evas_cserve2-evas_cserve2_main.o
  CC       bin/evas/bin_evas_evas_cserve2-evas_cserve2_slaves.o
  CC       bin/evas/bin_evas_evas_cserve2-evas_cserve2_messages.o
  CC       bin/evas/bin_evas_evas_cserve2-evas_cserve2_shm.o
make[4]: *** [Makefile:50038: bin/eolian_cxx/bin_eolian_cxx_eolian_cxx-eolian_cxx.o] Error 1
make[4]: *** Waiting for unfinished jobs....
make[3]: *** [Makefile:53799: all-recursive] Error 1
make[2]: *** [Makefile:17994: all] Error 2
make[1]: *** [Makefile:3011: all-recursive] Error 1
make: *** [Makefile:2098: all] Error 2
==> ERROR: A failure occurred in build().
    Aborting...
ApB created this task.Dec 17 2017, 2:17 AM
ApB closed this task as Resolved.Dec 18 2017, 1:30 AM
ApB claimed this task.

fixed.