Page MenuHomePhabricator
Feed Advanced Search

Sep 30 2019

bu5hm4n removed a parent task for T5337: Animation framework API for EO: T5301: Make EFL easier to use by improving its interface.
Sep 30 2019, 7:56 AM · efl (efl-1.21), efl: main loop, Restricted Project

Apr 10 2019

zmike archived efl (efl-1.21).
Apr 10 2019, 4:55 AM

Jan 14 2019

zmike added a comment to T7076: calendar widget: do not pass NULL to eo methods.

Is this still an issue?

Jan 14 2019, 11:31 AM · efl: data types, Restricted Project

Jan 11 2019

zmike closed T7295: focus manager infinite loop in genlist, a subtask of T7292: Elementary test genlist crash, freeze and other bugs, as Resolved.
Jan 11 2019, 8:09 AM · efl (efl-1.22)
zmike closed T7295: focus manager infinite loop in genlist as Resolved.

Fixed by Santa.

Jan 11 2019, 8:09 AM · regression, efl (efl-1.21)

Jan 8 2019

CHAN closed T7291: Elementary test spinner : months get displayed as numbers as Resolved.
Jan 8 2019, 2:25 AM · efl (efl-1.21)
CHAN added a comment to T7291: Elementary test spinner : months get displayed as numbers.

Oops i missed it.

Jan 8 2019, 2:24 AM · efl (efl-1.21)

Nov 26 2018

indefini added a comment to T7290: Elementary test Focus 3 - wrong focus with key up.

I tried with 1.21.1 and git and I was able to reproduce it with both.

Nov 26 2018, 5:54 PM · efl (efl-1.22), Restricted Project

Nov 20 2018

YOhoho closed T6806: focus(toolbar): focus tree of toolbar is broken as Resolved.
Nov 20 2018, 7:09 AM · efl (efl-1.21), Restricted Project
YOhoho added a comment to T7290: Elementary test Focus 3 - wrong focus with key up.

Can you check again?
I can't reproduce that.

Nov 20 2018, 7:06 AM · efl (efl-1.22), Restricted Project

Nov 16 2018

herdsman closed T7466: Evas test is broken with hyphen enabled as Resolved by committing rEFLde72dd57303a: Evas textblock: fix test to use provided hyphen dictionary.
Nov 16 2018, 1:28 AM · efl: canvas, efl (efl-1.21)

Nov 15 2018

cedric triaged T7466: Evas test is broken with hyphen enabled as Normal priority.
Nov 15 2018, 10:28 AM · efl: canvas, efl (efl-1.21)

Nov 14 2018

cedric closed T7354: Evas-preload segfaults as Resolved.

This was fixed in master with 0c1eab0cf999db94164b70a80cc3941561a26844 . I will backport that to efl-1.20 branch. The commit log doesn't seems to know why this is happening, which means there might still be a deeper problem. @stefan_schmidt you might want to keep an eye opened for this problem.

Nov 14 2018, 4:45 PM · enlightenment-git, efl (efl-1.21)

Nov 12 2018

bu5hm4n moved T6806: focus(toolbar): focus tree of toolbar is broken from Restricted Project Column to Restricted Project Column on the Restricted Project board.
Nov 12 2018, 2:20 AM · efl (efl-1.21), Restricted Project

Nov 2 2018

Diffusion added a commit to T6806: focus(toolbar): focus tree of toolbar is broken: rEFL79a5ff6e1e39: elm_toolbar: fix prio.visible.
Nov 2 2018, 1:54 AM · efl (efl-1.21), Restricted Project

Oct 29 2018

DaveMDS added a comment to T7360: Evas/Edje animations not in sync .

ah, yes, the issue is visible also resizing the window, It's the first time I try to resize the window.
The bug is also visible when you press one of the button to perform the animation, so I don't
think thi is related to window resize. Seems more like swallows are not in sync.

Oct 29 2018, 11:46 AM · efl: layout engine, efl: rendering, efl (efl-1.22), regression
raster added a comment to T7360: Evas/Edje animations not in sync .

it is when the window resizes right that you are talking about?

Oct 29 2018, 11:06 AM · efl: layout engine, efl: rendering, efl (efl-1.22), regression
raster added a comment to T7360: Evas/Edje animations not in sync .

oh that is weird... and bad.... this doesnt seem like animation and more like swallows are not following the parent correctly... at least when i resize....

Oct 29 2018, 11:06 AM · efl: layout engine, efl: rendering, efl (efl-1.22), regression

Oct 28 2018

DaveMDS updated subscribers of T7360: Evas/Edje animations not in sync .

add some more subscribers to keep this thread alive...

Oct 28 2018, 11:26 PM · efl: layout engine, efl: rendering, efl (efl-1.22), regression

Oct 22 2018

bu5hm4n added a comment to T6806: focus(toolbar): focus tree of toolbar is broken.

Can you test, with the complete patch set, starting at D7185 down to D7099.

Oct 22 2018, 5:31 AM · efl (efl-1.21), Restricted Project
YOhoho added a comment to T6806: focus(toolbar): focus tree of toolbar is broken.
  1. Focus is still gone after toolbar is resized(elementary_test -to toolbar (set focus to 'Elementary' item and reduce window size, then focus lost)

Works here.

  1. elementary_test -to toolbar
  2. Click 'Elementay' text item.
  3. reduce widow size until 'More' text item is shown.
  4. Press any arrow key. ( focus lost )
  1. Menu can't get focus using arrow key in Toolbar test (elementary_test -to toolbar)

Yes. Menu does not implement anything in regard of focus. Which was always the case. (T6892)

Oh, I mean 'Menu' text item.

  1. Focus can't escape in toolbar(elementary_test -to focus)

Works here. Are you up to date ?

Yes.

1. elementary_test
2. click 'focus' text button for focus test window.

This works well. But elementary_test -to focus has focus movement issue.
Please check again.

Oct 22 2018, 4:56 AM · efl (efl-1.21), Restricted Project
bu5hm4n added a comment to T6806: focus(toolbar): focus tree of toolbar is broken.

Okay - i fixed the toolbar issues. Which is once again absolutly NOT related to focus at all. I don't have a problem with fixing it. However - could we at least keep a little bit of context in tickets ? So focus tickets are not reopened again with issues that are in the toolbar?

Oct 22 2018, 1:09 AM · efl (efl-1.21), Restricted Project
bu5hm4n added a revision to T6806: focus(toolbar): focus tree of toolbar is broken: D7185: elm_toolbar: fix prio.visible.
Oct 22 2018, 1:07 AM · efl (efl-1.21), Restricted Project

Oct 21 2018

bu5hm4n added a comment to T6806: focus(toolbar): focus tree of toolbar is broken.
  1. Focus is still gone after toolbar is resized(elementary_test -to toolbar (set focus to 'Elementary' item and reduce window size, then focus lost)
Oct 21 2018, 11:52 PM · efl (efl-1.21), Restricted Project
YOhoho reopened T6806: focus(toolbar): focus tree of toolbar is broken as "Open".
  1. Focus is still gone after toolbar is resized(elementary_test -to toolbar (set focus to 'Elementary' item and reduce window size, then focus lost)
  2. Menu can't get focus using arrow key in Toolbar test (elementary_test -to toolbar)
  3. Focus can't escape in toolbar(elementary_test -to focus)
Oct 21 2018, 9:22 PM · efl (efl-1.21), Restricted Project
YOhoho added a comment to T6806: focus(toolbar): focus tree of toolbar is broken.

It seems that c14ea532eb74 break toolbar visibility
Please check elementary_test -to toolbar8

Oct 21 2018, 9:14 PM · efl (efl-1.21), Restricted Project

Sep 27 2018

devilhorns added a comment to T7360: Evas/Edje animations not in sync .

@DaveMDS Ok, good to know :) It was just a thought

Sep 27 2018, 4:05 AM · efl: layout engine, efl: rendering, efl (efl-1.22), regression

Sep 26 2018

DaveMDS added a comment to T7360: Evas/Edje animations not in sync .

@devilhorns: This issue is present in stable efl since the first day of the 1.21 release, cannot be related to the recent animator changes

Sep 26 2018, 10:25 PM · efl: layout engine, efl: rendering, efl (efl-1.22), regression
devilhorns updated subscribers of T7360: Evas/Edje animations not in sync .

@ManMower could this be related to your recent animator changes ?

Sep 26 2018, 12:51 PM · efl: layout engine, efl: rendering, efl (efl-1.22), regression
DaveMDS added a comment to T7360: Evas/Edje animations not in sync .

here a screenshot of the issue:


As you can see the home icon in the squared button is out of place while animating

Sep 26 2018, 12:32 PM · efl: layout engine, efl: rendering, efl (efl-1.22), regression
marinheiro added a comment to T7354: Evas-preload segfaults.

I have the same problem on a gentoo system, having just upgraded a previously working enlightenment to 0.22.3

Sep 26 2018, 4:30 AM · enlightenment-git, efl (efl-1.21)

Sep 19 2018

juippis closed T7351: efl-1.21.0 fails to build with '--enable-vnc-server' as Resolved.

I've disabled --enable-eglfs in Gentoo builds now. Thanks for the info about eglfs, and thanks for fixing vnc in 1.21.1 :)

Sep 19 2018, 9:02 AM · efl (efl-1.21)
bu5hm4n added a comment to T7351: efl-1.21.0 fails to build with '--enable-vnc-server'.

This Option only works for Android afair :) (--enable-eglfs)

Sep 19 2018, 8:50 AM · efl (efl-1.21)
juippis added a comment to T7351: efl-1.21.0 fails to build with '--enable-vnc-server'.

Tried with 1.21.1, still doesn't compile. Getting new errors though,

In file included from modules/evas/engines/eglfs/evas_outbuf.c:1:
modules/evas/engines/eglfs/evas_engine.h:18:11: fatal error: hwcomposer.h: No such file or directory
 # include <hwcomposer.h>
           ^~~~~~~~~~~~~~
compilation terminated.
make[4]: *** [Makefile:41177: modules/evas/engines/eglfs/modules_evas_engines_eglfs_module_la-evas_outbuf.lo] Error 1
make[4]: *** Waiting for unfinished jobs....
In file included from modules/evas/engines/eglfs/evas_engine.c:2:
modules/evas/engines/eglfs/evas_engine.h:18:11: fatal error: hwcomposer.h: No such file or directory
 # include <hwcomposer.h>
           ^~~~~~~~~~~~~~
compilation terminated.
make[4]: *** [Makefile:41184: modules/evas/engines/eglfs/modules_evas_engines_eglfs_module_la-evas_engine.lo] Error 1
make[3]: *** [Makefile:55124: all-recursive] Error 1
make[2]: *** [Makefile:18437: all] Error 2
make[1]: *** [Makefile:3014: all-recursive] Error 1
make: *** [Makefile:2101: all] Error 2

Am I missing some sort of a dependency outside efl?

Sep 19 2018, 5:13 AM · efl (efl-1.21)

Sep 14 2018

charlesgwaldman added a comment to T7354: Evas-preload segfaults.

Please see 'hidden' comment https://phab.enlightenment.org/T7354#124345

Sep 14 2018, 8:58 AM · enlightenment-git, efl (efl-1.21)

Sep 7 2018

Herald assigned T7354: Evas-preload segfaults to zmike.
Sep 7 2018, 2:36 PM · enlightenment-git, efl (efl-1.21)
charlesgwaldman added a project to T7354: Evas-preload segfaults: efl (efl-1.21).
Sep 7 2018, 2:35 PM · enlightenment-git, efl (efl-1.21)
ApB added a comment to T7350: Shadows on elm apps broken in 1.21.0/0.22.4.
[23:50] <ManMower> hahahaha
[23:50] <ManMower> so yeah, your gl problem is great
[23:51] <ManMower> and I think I know what it is
[23:51] <ManMower> could take a few days to resolve
[23:51] <ManMower> you're getting an ARGB2101010 visual.  only 2 bits of alpha, so that shadow's gonna suck
[23:53] <ManMower> ApBBB: if you could file a ticket and assign to me, if you haven't already
[23:53] <ManMower> mention ARGB2101010 :)
[23:54] <ManMower> I think the problem is... we're like "so yeah give me a visual with 8 bits of red, 8 bits of green, 8 bits of blue" and mesa's like "yup yup yup you said at least 8 bits, right?  10's good!"
[23:54] <ManMower> and alpha suffers
Sep 7 2018, 2:20 PM · Restricted Project, efl: rendering, efl (efl-1.22)
ApB reassigned T7350: Shadows on elm apps broken in 1.21.0/0.22.4 from zmike to ManMower.
Sep 7 2018, 2:00 PM · Restricted Project, efl: rendering, efl (efl-1.22)

Sep 6 2018

devilhorns added a commit to T7030: efl internals pass null objects to functions which should not be passed null: rEFL84423a465ca2: elementary: Check for valid focus manager before starting do loop.
Sep 6 2018, 9:29 AM · Restricted Project, efl: data types, Restricted Project
ajwillia.ms moved T6033: ELM: Genlist SEGV from Restricted Project Column to Restricted Project Column on the Restricted Project board.
Sep 6 2018, 12:56 AM · efl (efl-1.21), efl: widgets, Restricted Project

Sep 3 2018

bu5hm4n added a revision to T7351: efl-1.21.0 fails to build with '--enable-vnc-server': D6962: build: add keymapheader to dist tarbal.
Sep 3 2018, 3:19 AM · efl (efl-1.21)

Sep 2 2018

DaveMDS added projects to T7360: Evas/Edje animations not in sync : regression, Bug Report.
Sep 2 2018, 1:15 AM · efl: layout engine, efl: rendering, efl (efl-1.22), regression

Sep 1 2018

DaveMDS triaged T7360: Evas/Edje animations not in sync as High priority.
Sep 1 2018, 10:26 PM · efl: layout engine, efl: rendering, efl (efl-1.22), regression

Aug 28 2018

bu5hm4n added a project to T7351: efl-1.21.0 fails to build with '--enable-vnc-server': efl (efl-1.21).
Aug 28 2018, 5:08 AM · efl (efl-1.21)

Aug 27 2018

Herald assigned T7350: Shadows on elm apps broken in 1.21.0/0.22.4 to zmike.
Aug 27 2018, 11:22 PM · Restricted Project, efl: rendering, efl (efl-1.22)

Aug 26 2018

Hermet closed T6605: Ecore_Exe seems to send spurious events as Resolved by committing rEFLd1e4c6bab84e: ecore: fix built-in event types generation.
Aug 26 2018, 8:05 PM · efl (efl-1.21), efl: system integration

Aug 22 2018

jayji added a comment to T6605: Ecore_Exe seems to send spurious events.

Mhh.. it works for me. I've made a patch. Hopefully it will solve the problem.

Aug 22 2018, 11:18 AM · efl (efl-1.21), efl: system integration
jayji added a revision to T6605: Ecore_Exe seems to send spurious events: D6894: ecore: fix built-in event types generation.
Aug 22 2018, 11:17 AM · efl (efl-1.21), efl: system integration
zmike added a comment to T6605: Ecore_Exe seems to send spurious events.

That's what I tried when I first discovered it and I'm getting constant crashes. I suppose it's possible that it could somehow be local, but I did a clean reinstall...

Aug 22 2018, 10:31 AM · efl (efl-1.21), efl: system integration
jayji added a comment to T6605: Ecore_Exe seems to send spurious events.

Mhh,.. I'm actually not quite sure why just changing the initialization value in the constructor from -1 to 0 is not the way to go.

Aug 22 2018, 10:27 AM · efl (efl-1.21), efl: system integration

Aug 21 2018

zmike added a comment to T6605: Ecore_Exe seems to send spurious events.

Okay, like an idiot I believed the comment that I found. @jayji adding that extra call (and removing the wrong comment) does resolve it. If you submit a patch for this I'll review.

Aug 21 2018, 1:50 PM · efl (efl-1.21), efl: system integration
zmike added a comment to T6605: Ecore_Exe seems to send spurious events.

Although now that I'm testing a patch to do this, I'm getting an immediate crash on init?

Aug 21 2018, 1:47 PM · efl (efl-1.21), efl: system integration
zmike added a comment to T6605: Ecore_Exe seems to send spurious events.

No, this should be done in the constructor, which does the initialization to -1 instead of 0.

Aug 21 2018, 1:45 PM · efl (efl-1.21), efl: system integration
jayji added a comment to T6605: Ecore_Exe seems to send spurious events.

Oh wait... ecore code seems wrong

Aug 21 2018, 1:43 PM · efl (efl-1.21), efl: system integration
zmike added a comment to T6605: Ecore_Exe seems to send spurious events.

Oh.

Aug 21 2018, 1:31 PM · efl (efl-1.21), efl: system integration
zmike added a comment to T6605: Ecore_Exe seems to send spurious events.

wtf

Aug 21 2018, 1:29 PM · efl (efl-1.21), efl: system integration
jayji added a comment to T6605: Ecore_Exe seems to send spurious events.

Well, it seems that

Aug 21 2018, 1:24 PM · efl (efl-1.21), efl: system integration
zmike added a commit to T7292: Elementary test genlist crash, freeze and other bugs: rEFLdaaf5ad190ab: elm/genlist: check for item invalidation after setting item focus on click.
Aug 21 2018, 7:38 AM · efl (efl-1.22)
zmike added a commit to T7292: Elementary test genlist crash, freeze and other bugs: rEFLdcac8b24f189: elm/genlist: unset callbacks flag when destroying view object in unrealize.
Aug 21 2018, 7:38 AM · efl (efl-1.22)

Aug 20 2018

rvandegrift added a comment to T7327: dmabuf module build breaks with strict linking.

Confirmed working, thanks!

Aug 20 2018, 7:48 PM · efl (efl-1.21)
stefan_schmidt added a commit to T7154: $(OBJEXT) rules must be rewritten for automake 1.16 compatibility: Restricted Diffusion Commit.
Aug 20 2018, 1:03 PM · efl (efl-1.21), Restricted Project
stefan_schmidt added a commit to T7154: $(OBJEXT) rules must be rewritten for automake 1.16 compatibility: Restricted Diffusion Commit.
Aug 20 2018, 1:03 PM · efl (efl-1.21), Restricted Project
Hermet added a commit to T7000: Strange a call of animator: Restricted Diffusion Commit.
Aug 20 2018, 1:03 PM · efl (efl-1.21), efl: main loop
raster added a commit to T7113: DND broken and crashes elm_test: Restricted Diffusion Commit.
Aug 20 2018, 1:03 PM · efl: widgets, Restricted Project, efl (efl-1.21)
ManMower added a commit to T7327: dmabuf module build breaks with strict linking: rEFL2319ca7edbd3: ecore_wl2_dmabuf: Depend on ecore_wl2.
Aug 20 2018, 12:15 PM · efl (efl-1.21)
ManMower added a commit to T7327: dmabuf module build breaks with strict linking: rEFLeac7d3d116e4: ecore_wl2_dmabuf: Link with ecore_wl2.
Aug 20 2018, 12:15 PM · efl (efl-1.21)
zmike added a commit to T7327: dmabuf module build breaks with strict linking: rEFLe793a698dc39: ecore_wl2_dmabuf: Depend on ecore_wl2.
Aug 20 2018, 11:11 AM · efl (efl-1.21)
ManMower added a revision to T7327: dmabuf module build breaks with strict linking: D6875: ecore_wl2_dmabuf: Depend on ecore_wl2.
Aug 20 2018, 11:07 AM · efl (efl-1.21)
zmike closed T7327: dmabuf module build breaks with strict linking as Resolved by committing rEFL87332f2e3ab2: ecore_wl2_dmabuf: Link with ecore_wl2.
Aug 20 2018, 10:08 AM · efl (efl-1.21)
ManMower lowered the priority of T7327: dmabuf module build breaks with strict linking from High to Pending on user input.

Hi Ross,

Aug 20 2018, 8:17 AM · efl (efl-1.21)
ManMower added a revision to T7327: dmabuf module build breaks with strict linking: D6874: ecore_wl2_dmabuf: Link with ecore_wl2.
Aug 20 2018, 8:15 AM · efl (efl-1.21)
stefan_schmidt merged task T7320: EFL 1.21.0 documentation compilation fails due to missing file into T7166: "make doc" gets stuck because "shot" ELM_ENGINE is not working.
Aug 20 2018, 7:02 AM · efl (efl-1.21)
stefan_schmidt added a comment to T7320: EFL 1.21.0 documentation compilation fails due to missing file.

I digged into this. The missing file error has actually nothing to do with the hang you are seeing. That hang comes from a not finishing operation in the shot engine we use for generating the screenshots for the documentation.

Aug 20 2018, 7:02 AM · efl (efl-1.21)
stefan_schmidt triaged T7327: dmabuf module build breaks with strict linking as High priority.
Aug 20 2018, 3:05 AM · efl (efl-1.21)
stefan_schmidt added a project to T7327: dmabuf module build breaks with strict linking: efl (efl-1.21).
Aug 20 2018, 3:04 AM · efl (efl-1.21)
stefan_schmidt claimed T7320: EFL 1.21.0 documentation compilation fails due to missing file.

I edited the title to reflect that the doc build is broken and not the normal EFL build.

Aug 20 2018, 3:01 AM · efl (efl-1.21)
stefan_schmidt renamed T7320: EFL 1.21.0 documentation compilation fails due to missing file from EFL 1.21.0 compilation fails due to missing file to EFL 1.21.0 documentation compilation fails due to missing file.
Aug 20 2018, 3:00 AM · efl (efl-1.21)
Diffusion closed T7213: efl_ui_calendar crash issue., a subtask of T7030: efl internals pass null objects to functions which should not be passed null, as Resolved.
Aug 20 2018, 2:56 AM · Restricted Project, efl: data types, Restricted Project
Diffusion closed T7213: efl_ui_calendar crash issue. as Resolved by committing rEFL8da56ac873d5: efl_ui_composition: remove all children in invalidate.
Aug 20 2018, 2:56 AM · efl: widgets, efl (efl-1.21)

Aug 18 2018

denkijin added a comment to T7320: EFL 1.21.0 documentation compilation fails due to missing file.

Thanks @ApB, that worked

Aug 18 2018, 4:13 PM · efl (efl-1.21)
jayji added a comment to T6605: Ecore_Exe seems to send spurious events.

It crashed again this night... but there is too much eo stuff... What I can see is that the data field of Efl_Loop_Message is NULL (that's the final NULL ptr)

Aug 18 2018, 4:12 AM · efl (efl-1.21), efl: system integration
ApB added a comment to T7320: EFL 1.21.0 documentation compilation fails due to missing file.

if you disable the documentation build it will work fine. In case you dont need efl-docs you can use the PKGBUILD below:

Aug 18 2018, 3:49 AM · efl (efl-1.21)
denkijin triaged T7320: EFL 1.21.0 documentation compilation fails due to missing file as Showstopper Issues priority.
Aug 18 2018, 2:32 AM · efl (efl-1.21)

Aug 17 2018

stefan_schmidt closed T7313: Ctxpopup dont show scrollbars when needed as Resolved by committing rEFL791fc27c4072: elm/list: correctly handle ELM_LIST_COMPRESS.
Aug 17 2018, 2:44 PM · regression, efl: widgets, efl (efl-1.21)
stefan_schmidt closed T7259: Elm_code crash when deleting as Resolved by committing rEFL0f21b1f7aaac: elm_code: fix crash on backspace and selection delete..
Aug 17 2018, 12:48 PM · efl (efl-1.21), efl: widgets
jayji added a comment to T6605: Ecore_Exe seems to send spurious events.

It is pretty hard to reproduce, as it usually happens over night (but not regularly). I'll investigate the next core dump.

Aug 17 2018, 12:26 PM · efl (efl-1.21), efl: system integration
DaveMDS added a comment to T7313: Ctxpopup dont show scrollbars when needed.

Indeed D6860 fix the scroll-bar visibility and seems to restore the old behavior

Aug 17 2018, 9:41 AM · regression, efl: widgets, efl (efl-1.21)
devilhorns added a commit to T7030: efl internals pass null objects to functions which should not be passed null: rEFL364ca1d2b2bb: elementary: Check for valid focus manager before starting do loop.
Aug 17 2018, 8:30 AM · Restricted Project, efl: data types, Restricted Project
zmike added a revision to T7313: Ctxpopup dont show scrollbars when needed: D6860: elm/list: correctly handle ELM_LIST_COMPRESS.
Aug 17 2018, 8:13 AM · regression, efl: widgets, efl (efl-1.21)
zmike added a comment to T7313: Ctxpopup dont show scrollbars when needed.

Happily, this was not caused by the fix for T7176 and existed prior to that.

Aug 17 2018, 7:42 AM · regression, efl: widgets, efl (efl-1.21)
DaveMDS triaged T7313: Ctxpopup dont show scrollbars when needed as Showstopper Issues priority.
Aug 17 2018, 12:36 AM · regression, efl: widgets, efl (efl-1.21)

Aug 16 2018

indefini added a comment to T7259: Elm_code crash when deleting .

@stefan_schmidt yes confirmed, no crash with the patch.

Aug 16 2018, 4:53 PM · efl (efl-1.21), efl: widgets
zmike added a comment to T7259: Elm_code crash when deleting .

Confirmed.

Aug 16 2018, 7:00 AM · efl (efl-1.21), efl: widgets
stefan_schmidt added a comment to T7259: Elm_code crash when deleting .

@indefini could you give the patch from netstar a try and confirm if it fixed the issue for you?

Aug 16 2018, 6:28 AM · efl (efl-1.21), efl: widgets

Aug 15 2018

netstar added a revision to T7259: Elm_code crash when deleting : D6835: elm_code: fix crash on backspace and selection delete..
Aug 15 2018, 3:35 AM · efl (efl-1.21), efl: widgets
netstar closed T7031: elm_code internals pass null to functions as Resolved.

This is fixed. I'm using elm_code and nothing bad is being printed to the console. EFL revision as of 20 minutes ago of posting this.

Aug 15 2018, 2:14 AM · efl: widgets, Restricted Project, efl (efl-1.21)
netstar closed T7031: elm_code internals pass null to functions, a subtask of T7030: efl internals pass null objects to functions which should not be passed null, as Resolved.
Aug 15 2018, 2:13 AM · Restricted Project, efl: data types, Restricted Project
netstar added a comment to T7296: focus manager errors.
       /usr/local/lib/libeina.so.1      |                     /src/efl/src/lib/eina/eina_log.c                       : 2055 @ eina_log_print_cb_stderr()
       /usr/local/lib/libeina.so.1      |                     /src/efl/src/lib/eina/eina_log.c                       : 1454 @ eina_log_print_unlocked()
       /usr/local/lib/libeina.so.1      |                     /src/efl/src/lib/eina/eina_log.c                       : 2259 @ eina_log_print()
       /usr/local/lib/libeina.so.1      |                     /src/efl/src/lib/eina/eina_safety_checks.c             :   83 @ _eina_safety_error()
       /usr/local/lib/libelementary.so.1|               /src/efl/src/lib/elementary/efl_ui_focus_manager_calc.c      :  103 @ _manager_in_chain_set()
       /usr/local/lib/libelementary.so.1|               /src/efl/src/lib/elementary/efl_ui_focus_manager_calc.c      : 1344 @ _efl_ui_focus_manager_calc_efl_ui_focus_manager_manager_focus_set()
       /usr/local/lib/libelementary.so.1|               /src/efl/src/lib/elementary/efl_ui_focus_manager.eo.c        :   11 @ efl_ui_focus_manager_focus_set()
       /usr/local/lib/libelementary.so.1|               /src/efl/src/lib/elementary/efl_ui_focus_manager_root_focus.c:  107 @ _efl_ui_focus_manager_root_focus_efl_ui_focus_manager_manager_focus_set()
       /usr/local/lib/libelementary.so.1|               /src/efl/src/lib/elementary/efl_ui_focus_manager.eo.c        :   11 @ efl_ui_focus_manager_focus_set()
       /usr/local/lib/libelementary.so.1|               /src/efl/src/lib/elementary/efl_ui_focus_manager_calc.c      :  805 @ _efl_ui_focus_manager_calc_efl_ui_focus_manager_redirect_set()
       /usr/local/lib/libelementary.so.1|               /src/efl/src/lib/elementary/efl_ui_focus_manager.eo.c        :   13 @ efl_ui_focus_manager_redirect_set()
       /usr/local/lib/libelementary.so.1|               /src/efl/src/lib/elementary/efl_ui_focus_manager_calc.c      :  774 @ _redirect_del()
       /usr/local/lib/libeo.so.1        |                       /src/efl/src/lib/eo/eo_base_class.c                  : 1700 @ _event_callback_call()
       /usr/local/lib/libeo.so.1        |                       /src/efl/src/lib/eo/eo_base_class.c                  : 1760 @ _efl_object_event_callback_call()
       /usr/local/lib/libeo.so.1        |                       /src/efl/src/lib/eo/eo_base_class.c                  : 1762 @ efl_event_callback_call()
       /usr/local/lib/libevas.so.1      |              /src/efl/src/lib/evas/canvas/evas_object_main.c               : 1194 @ _efl_canvas_object_efl_object_event_callback_call()
       /usr/local/lib/libeo.so.1        |                       /src/efl/src/lib/eo/eo_base_class.c                  : 1762 @ efl_event_callback_call()
       /usr/local/lib/libeo.so.1        |                       /src/efl/src/lib/eo/eo_private.h                     :  297 @ _efl_del_internal()
       /usr/local/lib/libeo.so.1        |                       /src/efl/src/lib/eo/eo_private.h                     :  382 @ _efl_unref_internal()
       /usr/local/lib/libeo.so.1        |                       /src/efl/src/lib/eo/eo_base_class.c                  :  695 @ efl_del()
       /usr/local/lib/libevas.so.1      |              /src/efl/src/lib/evas/canvas/evas_object_main.c               : 1043 @ evas_object_del()
       /usr/local/lib/libelementary.so.1|               /src/efl/src/lib/elementary/efl_ui_widget.c                  :  845 @ _efl_ui_widget_efl_canvas_group_group_del()
       /usr/local/lib/libevas.so.1      |              /src/efl/src/lib/evas/canvas/evas_object_smart.c              : 1861 @ efl_canvas_group_del()
       /usr/local/lib/libelementary.so.1|               /src/efl/src/lib/elementary/elm_table.c                      :  135 @ _elm_table_efl_canvas_group_group_del()
       /usr/local/lib/libevas.so.1      |              /src/efl/src/lib/evas/canvas/evas_object_smart.c              : 1861 @ efl_canvas_group_del()
       /usr/local/lib/libevas.so.1      |              /src/efl/src/lib/evas/canvas/evas_object_smart.c              : 1296 @ evas_object_smart_del()
       /usr/local/lib/libevas.so.1      |              /src/efl/src/lib/evas/canvas/evas_object_main.c               : 1339 @ _efl_canvas_object_efl_object_invalidate()
       /usr/local/lib/libeo.so.1        |                       /src/efl/src/lib/eo/efl_object.eo.c                  :   72 @ efl_invalidate()
       /usr/local/lib/libelementary.so.1|               /src/efl/src/lib/elementary/efl_access_object.c              :  635 @ _efl_access_object_efl_object_invalidate()
       /usr/local/lib/libeo.so.1        |                       /src/efl/src/lib/eo/efl_object.eo.c                  :   72 @ efl_invalidate()
       /usr/local/lib/libeo.so.1        |                       /src/efl/src/lib/eo/eo_base_class.c                  :  173 @ _efl_invalidate()
       /usr/local/lib/libeo.so.1        |                       /src/efl/src/lib/eo/eo_base_class.c                  :  738 @ _efl_object_parent_set()
       /usr/local/lib/libeo.so.1        |                       /src/efl/src/lib/eo/efl_object.eo.c                  :   12 @ efl_parent_set()
       /usr/local/lib/libeo.so.1        |                       /src/efl/src/lib/eo/eo_base_class.c                  :  687 @ efl_del()
       /usr/local/lib/libevas.so.1      |              /src/efl/src/lib/evas/canvas/evas_object_main.c               : 1043 @ evas_object_del()
       /usr/local/lib/libelementary.so.1|               /src/efl/src/lib/elementary/efl_ui_widget.c                  :  845 @ _efl_ui_widget_efl_canvas_group_group_del()
       /usr/local/lib/libevas.so.1      |              /src/efl/src/lib/evas/canvas/evas_object_smart.c              : 1861 @ efl_canvas_group_del()
       /usr/local/lib/libelementary.so.1|               /src/efl/src/lib/elementary/efl_ui_layout_object.c           :  809 @ _efl_ui_layout_efl_canvas_group_group_del()
       /usr/local/lib/libevas.so.1      |              /src/efl/src/lib/evas/canvas/evas_object_smart.c              : 1861 @ efl_canvas_group_del()
       /usr/local/lib/libelementary.so.1|               /src/efl/src/lib/elementary/elm_hover.c                      :  632 @ _elm_hover_efl_canvas_group_group_del()
       /usr/local/lib/libevas.so.1      |              /src/efl/src/lib/evas/canvas/evas_object_smart.c              : 1861 @ efl_canvas_group_del()
       /usr/local/lib/libevas.so.1      |              /src/efl/src/lib/evas/canvas/evas_object_smart.c              : 1296 @ evas_object_smart_del()
       /usr/local/lib/libevas.so.1      |              /src/efl/src/lib/evas/canvas/evas_object_main.c               : 1339 @ _efl_canvas_object_efl_object_invalidate()
       /usr/local/lib/libeo.so.1        |                       /src/efl/src/lib/eo/efl_object.eo.c                  :   72 @ efl_invalidate()
       /usr/local/lib/libelementary.so.1|               /src/efl/src/lib/elementary/efl_access_object.c              :  635 @ _efl_access_object_efl_object_invalidate()
       /usr/local/lib/libeo.so.1        |                       /src/efl/src/lib/eo/efl_object.eo.c                  :   72 @ efl_invalidate()
       /usr/local/lib/libeo.so.1        |                       /src/efl/src/lib/eo/eo_base_class.c                  :  173 @ _efl_invalidate()
       /usr/local/lib/libeo.so.1        |                       /src/efl/src/lib/eo/eo_base_class.c                  :  738 @ _efl_object_parent_set()
       /usr/local/lib/libeo.so.1        |                       /src/efl/src/lib/eo/efl_object.eo.c                  :   12 @ efl_parent_set()
       /usr/local/lib/libeo.so.1        |                       /src/efl/src/lib/eo/eo_base_class.c                  :  687 @ efl_del()
       /usr/local/lib/libevas.so.1      |              /src/efl/src/lib/evas/canvas/evas_object_main.c               : 1043 @ evas_object_del()
       /usr/local/lib/libelementary.so.1|               /src/efl/src/lib/elementary/elc_hoversel.c                   :  371 @ _hover_del()
       /usr/local/lib/libelementary.so.1|               /src/efl/src/lib/elementary/elc_hoversel.c                   :  395 @ _hover_end_finished()
       /usr/local/lib/libelementary.so.1|               /src/efl/src/lib/elementary/efl_ui_layout_object.c           :  577 @ _edje_signal_callback()
       /usr/local/lib/libedje.so.1      |                     /src/efl/src/lib/edje/edje_program.c                   : 1671 @ _edje_emit_cb()
       /usr/local/lib/libedje.so.1      |                     /src/efl/src/lib/edje/edje_program.c                   : 1590 @ _edje_emit_handle()
       /usr/local/lib/libedje.so.1      |                     /src/efl/src/lib/edje/edje_message_queue.c             :  788 @ _edje_message_process()
       /usr/local/lib/libedje.so.1      |                     /src/efl/src/lib/edje/edje_message_queue.c             :  887 @ _edje_message_queue_process()
       /usr/local/lib/libedje.so.1      |                     /src/efl/src/lib/edje/edje_message_queue.c             :  261 @ _edje_job()
       /usr/local/lib/libecore.so.1     |                    /src/efl/src/lib/ecore/ecore_job.c                      :   99 @ _ecore_job_event_handler()
       /usr/local/lib/libecore.so.1     |                    /src/efl/src/lib/ecore/ecore_event_message_handler.c    :  359 @ _ecore_event_message_handler_efl_loop_message_handler_message_call()
       /usr/local/lib/libecore.so.1     |                    /src/efl/src/lib/ecore/efl_loop_message_handler.eo.c    :   14 @ efl_loop_message_handler_message_call()
       /usr/local/lib/libecore.so.1     |                    /src/efl/src/lib/ecore/efl_loop.c                       :  633 @ _efl_loop_message_process()
       /usr/local/lib/libecore.so.1     |                    /src/efl/src/lib/ecore/efl_loop.c                       :  663 @ efl_loop_message_process()
       /usr/local/lib/libecore.so.1     |                    /src/efl/src/lib/ecore/ecore_main.c                     : 2459 @ _ecore_main_loop_iterate_internal()
       /usr/local/lib/libecore.so.1     |                    /src/efl/src/lib/ecore/ecore_main.c                     : 1190 @ _ecore_main_loop_begin()
       /usr/local/lib/libecore.so.1     |                    /src/efl/src/lib/ecore/efl_loop.c                       :   84 @ _efl_loop_begin()
       /usr/local/lib/libecore.so.1     |                    /src/efl/src/lib/ecore/efl_loop.eo.c                    :   28 @ efl_loop_begin()
       /usr/local/bin/elementary_test   |               /src/efl/src/bin/elementary/test.c                           : 1369 @ main()
/lib/x86_64-linux-gnu/libc.so.6         | /build/glibc-20LlRo/glibc-2.27/csu/../csu/libc-start.c                     :  344 @ __libc_start_main()
       /usr/local/bin/elementary_test   |                                        ??/??                               :  344 @ _start()
Aug 15 2018, 2:12 AM · Restricted Project
netstar closed T7266: evas_object_event_callback_del_full() safety check failed: eo_obj == NULL as Resolved by committing rEFLe708c0ae3390: elm/list: use while() loop to iterate item list during smart delete.
Aug 15 2018, 1:46 AM · efl: data types, Restricted Project, efl (efl-1.21)